Reaction Details
TargetAlpha-1A adrenergic receptor
LigandBDBM50220787
Substrate/Competitorn/a
Meas. Tech.ChEMBL_33887 (CHEMBL643759)
Ki 1.6±n/a nM
Citation Lopez, FJArias, LChan, RClarke, DEElworthy, TRFord, APGuzman, AJaime-Figueroa, SJasper, JRMorgans, DJPadilla, FPerez-Medrano, AQuintero, CRomero, MSandoval, LSmith, SAWilliams, TJBlue, DR Synthesis, pharmacology and pharmacokinetics of 3-(4-aryl-piperazin-1-ylalkyl)-uracils as uroselective alpha1A-antagonists. Bioorg Med Chem Lett13:1873-8 (2003) Alpha-1A adrenergic receptor
Name:Alpha-1A adrenergic receptor
Type:Cell-surface receptors
Mol. Mass.:51511.67
Organism:Homo sapiens (Human)
Description:P35348
Residue:466
BDBM50220787
NameBDBM50220787
Synonyms:CHEMBL418112
TypeSmall organic molecule
Emp. Form.C20H24F4N4O4
Mol. Mass.460.4226
SMILESCOc1c[nH]c(=O)n(CCCN2CCN(CC2)c2ccc(F)cc2OCC(F)(F)F)c1=O