Reaction Details
TargetAlpha-1D adrenergic receptor
LigandBDBM50220746
Substrate/Competitorn/a
Meas. Tech.ChEMBL_32602 (CHEMBL642129)
Ki 5.0±n/a nM
Citation Lopez, FJArias, LChan, RClarke, DEElworthy, TRFord, APGuzman, AJaime-Figueroa, SJasper, JRMorgans, DJPadilla, FPerez-Medrano, AQuintero, CRomero, MSandoval, LSmith, SAWilliams, TJBlue, DR Synthesis, pharmacology and pharmacokinetics of 3-(4-aryl-piperazin-1-ylalkyl)-uracils as uroselective alpha1A-antagonists. Bioorg Med Chem Lett13:1873-8 (2003) Alpha-1D adrenergic receptor
Name:Alpha-1D adrenergic receptor
Type:Enzyme Catalytic Domain
Mol. Mass.:60485.82
Organism:Homo sapiens (Human)
Description:adrenergic Alpha1D ADRA1D HUMAN::P25100
Residue:572
BDBM50220746
NameBDBM50220746
Synonyms:CHEMBL292189
TypeSmall organic molecule
Emp. Form.C21H27F3N4O3
Mol. Mass.440.4593
SMILESCc1[nH]c(=O)n(CCCN2CCN(CC2)c2ccccc2OCC(F)(F)F)c(=O)c1C