Reaction Details
TargetAlpha-1A adrenergic receptor
LigandBDBM50220788
Substrate/Competitorn/a
Meas. Tech.ChEMBL_33887 (CHEMBL643759)
Ki 0.251189±n/a nM
Citation Lopez, FJArias, LChan, RClarke, DEElworthy, TRFord, APGuzman, AJaime-Figueroa, SJasper, JRMorgans, DJPadilla, FPerez-Medrano, AQuintero, CRomero, MSandoval, LSmith, SAWilliams, TJBlue, DR Synthesis, pharmacology and pharmacokinetics of 3-(4-aryl-piperazin-1-ylalkyl)-uracils as uroselective alpha1A-antagonists. Bioorg Med Chem Lett13:1873-8 (2003) Alpha-1A adrenergic receptor
Name:Alpha-1A adrenergic receptor
Type:Cell-surface receptors
Mol. Mass.:51511.67
Organism:Homo sapiens (Human)
Description:P35348
Residue:466
BDBM50220788
NameBDBM50220788
Synonyms:CHEMBL417954
TypeSmall organic molecule
Emp. Form.C19H21F5N4O3
Mol. Mass.448.3871
SMILESFc1ccc(N2CCN(CCCn3c(=O)[nH]cc(F)c3=O)CC2)c(OCC(F)(F)F)c1