Reaction Details
TargetcAMP-specific 3',5'-cyclic phosphodiesterase 4A/4B/4C/4D
LigandBDBM50220987
Substrate/Competitorn/a
Meas. Tech.ChEMBL_155002 (CHEMBL764539)
IC50 70±n/a nM
Citation Ukita, TSugahara, MTerakawa, YKuroda, TWada, KNakata, AKikkawa, HIkezawa, KNaito, K Synthesis and biological activities of 1-pyridylisoquinoline and 1-pyridyldihydroisoquinoline derivatives as PDE4 inhibitors. Bioorg Med Chem Lett13:2347-50 (2003) cAMP-specific 3',5'-cyclic phosphodiesterase 4A/4B/4C/4D
Name:cAMP-specific 3',5'-cyclic phosphodiesterase 4A/4B/4C/4D
Synonyms:Phosphodiesterase 4
Type:n/a
Mol. Mass.:n/a
Description:ASSAY_ID of ChEMBL is 788178
Components:This complex has 4 components.
Component 1
Name:cAMP-specific 3',5'-cyclic phosphodiesterase 4A
Type:Enzyme
Mol. Mass.:98113.27
Organism:Homo sapiens (Human)
Description:P27815
Residue:886
Component 2
Name:cAMP-specific 3',5'-cyclic phosphodiesterase 4D
Synonyms:3',5'-cyclic phosphodiesterase PDE43 PDE4D_HUMAN | Phosphodiesterase 4D
Type:Protein
Mol. Mass.:91092.69
Organism:Homo sapiens (Human)
Description:Q08499
Residue:809
Component 3
Name:cAMP-specific 3',5'-cyclic phosphodiesterase 4B
Synonyms:3',5'-cyclic phosphodiesterase Isoform PDE4B1 PDE4B PDE4B_HUMAN Phosphodiesterase 4B (PDE4B) Phosphodiesterase Type 4 (PDE4B)
Type:Protein
Mol. Mass.:83318.87
Organism:Homo sapiens (Human)
Description:Q07343
Residue:736
Component 4
Name:cAMP-specific 3',5'-cyclic phosphodiesterase 4C
Synonyms:3',5'-cyclic phosphodiesterase NP_000914.2 PDE4C | PDE4C1
Type:Enzyme Catalytic Domain
Mol. Mass.:79875.54
Organism:Homo sapiens (Human)
Description:Q08493
Residue:712
BDBM50220987
NameBDBM50220987
Synonyms:CHEMBL553278
TypeSmall organic molecule
Emp. Form.C31H26ClN5O5
Mol. Mass.584.022
SMILESCl.COc1cc2nc(CO)c(CO)c(-c3ccnc(c3)-n3nc(-c4cccnc4)c4ccccc4c3=O)c2cc1OC