Reaction Details
Target5-hydroxytryptamine receptor 7
LigandBDBM50222052
Substrate/Competitorn/a
Meas. Tech.ChEMBL_3765 (CHEMBL857990)
Ki 17±n/a nM
Citation Parikh, VWelch, WMSchmidt, AW Discovery of a series of (4,5-dihydroimidazol-2-yl)-biphenylamine 5-HT7 agonists. Bioorg Med Chem Lett13:269-71 (2003) 5-hydroxytryptamine receptor 7
Name:5-hydroxytryptamine receptor 7
Type:G Protein-Coupled Receptor (GPCR)
Mol. Mass.:49852.62
Organism:Rattus norvegicus (rat)
Description:Rat cloned 5-HT7R.
Residue:448
BDBM50222052
NameBDBM50222052
Synonyms:CHEMBL329548
TypeSmall organic molecule
Emp. Form.C14H15N3S
Mol. Mass.257.354
SMILESCc1c(NC2=NCCN2)cccc1-c1cccs1