Reaction Details
Target5-hydroxytryptamine receptor 7
LigandBDBM50130287
Substrate/Competitorn/a
Meas. Tech.ChEMBL_3765 (CHEMBL857990)
Ki 16±n/a nM
Citation Parikh, VWelch, WMSchmidt, AW Discovery of a series of (4,5-dihydroimidazol-2-yl)-biphenylamine 5-HT7 agonists. Bioorg Med Chem Lett13:269-71 (2003) 5-hydroxytryptamine receptor 7
Name:5-hydroxytryptamine receptor 7
Type:G Protein-Coupled Receptor (GPCR)
Mol. Mass.:49852.62
Organism:Rattus norvegicus (rat)
Description:Rat cloned 5-HT7R.
Residue:448
BDBM50130287
NameBDBM50130287
Synonyms:(4,5-Dihydro-1H-imidazol-2-yl)-(2-methyl-biphenyl-3-yl)-amine | CHEMBL92221
TypeSmall organic molecule
Emp. Form.C16H17N3
Mol. Mass.251.3263
SMILES[#6]-c1c(cccc1-c1ccccc1)\[#7]=[#6]-1/[#7]-[#6]-[#6]-[#7]-1