Reaction Details
TargetDNA gyrase subunit A/B
LigandBDBM50223600
Substrate/Competitorn/a
Meas. Tech.ChEMBL_50464 (CHEMBL657334)
IC50 2340±n/a nM
Citation Tanitame, AOyamada, YOfuji, KKyoya, YSuzuki, KIto, HKawasaki, MNagai, KWachi, MYamagishi, J Design, synthesis and structure-activity relationship studies of novel indazole analogues as DNA gyrase inhibitors with Gram-positive antibacterial activity. Bioorg Med Chem Lett14:2857-62 (2004) DNA gyrase subunit A/B
Name:DNA gyrase subunit A/B
Type:A2B2 tetramer
Mol. Mass.:n/a
Description:n/a
Components:This complex has 2 components.
Component 1
Name:DNA gyrase subunit A
Synonyms:DNA gyrase GYRA_ECOLI hisW parD
Type:Enzyme Subunit
Mol. Mass.:96935.15
Organism:Escherichia coli (strain K12)
Description:n/a
Residue:875
Component 2
Name:DNA gyrase subunit B
Synonyms:DNA gyrase subunit B GYRB_ECOLI acrB gyrB hisU parA | pcbA
Type:Enzyme Subunit
Mol. Mass.:89941.28
Organism:Escherichia coli (strain K12)
Description:P0AES6
Residue:804
BDBM50223600
NameBDBM50223600
Synonyms:CHEMBL316656
TypeSmall organic molecule
Emp. Form.C23H27ClN4O2
Mol. Mass.426.939
SMILESCOC(=O)C1CCCC(C1)NCc1cc(\C=C\c2cn(C)c3ccc(Cl)cc23)[nH]n1