Reaction Details
TargetD(2) dopamine receptor
LigandBDBM50223743
Substrate/Competitorn/a
Meas. Tech.ChEMBL_61144 (CHEMBL670681)
Ki 436±n/a nM
Citation Caro, YTorrado, MMasaguer, CFRaviña, EPadín, FBrea, JLoza, MI Chemoenzymatic synthesis and binding affinity of novel (R)- and (S)-3-aminomethyl-1-tetralones, potential atypical antipsychotics. Bioorg Med Chem Lett14:585-9 (2004) D(2) dopamine receptor
Name:D(2) dopamine receptor
Type:Cell-surface receptors
Mol. Mass.:50647.10
Organism:Homo sapiens (Human)
Description:P14416
Residue:443
BDBM50223743
NameBDBM50223743
Synonyms:CHEMBL421801
TypeSmall organic molecule
Emp. Form.C24H25FN2O3
Mol. Mass.408.4653
SMILESCOc1ccc2C(=O)CC(CN3CCC(CC3)c3noc4cc(F)ccc34)Cc2c1