Reaction Details
Target5-hydroxytryptamine receptor 2A
LigandBDBM50223743
Substrate/Competitorn/a
Meas. Tech.ChEMBL_2464 (CHEMBL617352)
Ki 26.3±n/a nM
Citation Caro, YTorrado, MMasaguer, CFRaviña, EPadín, FBrea, JLoza, MI Chemoenzymatic synthesis and binding affinity of novel (R)- and (S)-3-aminomethyl-1-tetralones, potential atypical antipsychotics. Bioorg Med Chem Lett14:585-9 (2004) 5-hydroxytryptamine receptor 2A
Name:5-hydroxytryptamine receptor 2A
Type:undefined
Mol. Mass.:52607.65
Organism:Homo sapiens (Human)
Description:P28223
Residue:471
BDBM50223743
NameBDBM50223743
Synonyms:CHEMBL421801
TypeSmall organic molecule
Emp. Form.C24H25FN2O3
Mol. Mass.408.4653
SMILESCOc1ccc2C(=O)CC(CN3CCC(CC3)c3noc4cc(F)ccc34)Cc2c1