Reaction Details
TargetGonadotropin-releasing hormone receptor
LigandBDBM50224090
Substrate/Competitorn/a
Meas. Tech.ChEMBL_100015 (CHEMBL709253)
Ki 0.851138±n/a nM
Citation Randolph, JTSauer, DRHaviv, FNilius, AMGreer, J Elimination of antibacterial activities of non-peptide luteinizing hormone-releasing hormone (LHRH) antagonists derived from erythromycin A. Bioorg Med Chem Lett14:1599-602 (2004) Gonadotropin-releasing hormone receptor
Name:Gonadotropin-releasing hormone receptor
Type:Enzyme
Mol. Mass.:37749.45
Organism:Homo sapiens (Human)
Description:P30968
Residue:328
BDBM50224090
NameBDBM50224090
Synonyms:CHEMBL410940
TypeSmall organic molecule
Emp. Form.C53H82ClFN2O13
Mol. Mass.1009.675
SMILES[H][C@@]12[C@@H](C)C(=O)[C@H](C)C[C@](C)(OC)[C@H](OC3O[C@H](C)C[C@@H]([C@H]3O)N(CC3CC3)CC3CC3)[C@@H](C)[C@H](OC3C[C@@](C)(OC)[C@@H](O)[C@H](C)O3)[C@@H](C)C(=O)O[C@H](CC)[C@@]1(C)OC(=O)N2CCc1ccc(F)c(Cl)c1