Reaction Details
TargetGonadotropin-releasing hormone receptor
LigandBDBM50224092
Substrate/Competitorn/a
Meas. Tech.ChEMBL_100015 (CHEMBL709253)
Ki 28±n/a nM
Citation Randolph, JTSauer, DRHaviv, FNilius, AMGreer, J Elimination of antibacterial activities of non-peptide luteinizing hormone-releasing hormone (LHRH) antagonists derived from erythromycin A. Bioorg Med Chem Lett14:1599-602 (2004) Gonadotropin-releasing hormone receptor
Name:Gonadotropin-releasing hormone receptor
Type:Enzyme
Mol. Mass.:37749.45
Organism:Homo sapiens (Human)
Description:P30968
Residue:328
BDBM50224092
NameBDBM50224092
Synonyms:CHEMBL216252
TypeSmall organic molecule
Emp. Form.C53H85ClN2O13
Mol. Mass.993.701
SMILES[H][C@@]12[C@@H](C)C(=O)[C@H](C)C[C@](C)(OC)[C@H](OC3O[C@H](C)C[C@@H]([C@H]3O)N(CC3CC3)C(C)CC)[C@@H](C)[C@H](OC3C[C@@](C)(OC)[C@@H](O)[C@H](C)O3)[C@@H](C)C(=O)O[C@H](CC)[C@@]1(C)OC(=O)N2CCc1ccc(Cl)cc1