Reaction Details
TargetGonadotropin-releasing hormone receptor
LigandBDBM50001566
Substrate/Competitorn/a
Meas. Tech.ChEMBL_100015 (CHEMBL709253)
Ki 19±n/a nM
Citation Randolph, JTSauer, DRHaviv, FNilius, AMGreer, J Elimination of antibacterial activities of non-peptide luteinizing hormone-releasing hormone (LHRH) antagonists derived from erythromycin A. Bioorg Med Chem Lett14:1599-602 (2004) Gonadotropin-releasing hormone receptor
Name:Gonadotropin-releasing hormone receptor
Type:Enzyme
Mol. Mass.:37749.45
Organism:Homo sapiens (Human)
Description:P30968
Residue:328
BDBM50001566
NameBDBM50001566
Synonyms:CHEMBL275467
TypeSmall organic molecule
Emp. Form.C46H70ClN3O13
Mol. Mass.908.513
SMILES[H][C@@]12[C@@H](C)C(=O)[C@H](C)C[C@](C)(OC)[C@H](OC3O[C@H](C)C[C@@H]([C@H]3O)N(C)C(C)C)[C@@H](C)[C@H](OC(=O)N3[C@@H](C)COC3=O)[C@@H](C)C(=O)O[C@H](CC)[C@@]1(C)OC(=O)N2CCc1ccc(Cl)cc1