Reaction Details
TargetBeta-1/Beta-2/Beta-3 adrenergic receptor
LigandBDBM50223424
Substrate/Competitorn/a
Meas. Tech.ChEMBL_38735 (CHEMBL647418)
IC50 9000±n/a nM
Citation Henkel, JGSikand, NMakriyannis, AGianutsos, G Synthesis and adrenoceptor affinity of some highly polar beta-substituted catecholamines. J Med Chem24:1258-60 (1981) Beta-1/Beta-2/Beta-3 adrenergic receptor
Name:Beta-1/Beta-2/Beta-3 adrenergic receptor
Synonyms:Adrenergic receptor beta
Type:n/a
Mol. Mass.:n/a
Description:ASSAY_ID of ChEMBL is 1340543
Components:This complex has 3 components.
Component 1
Name:Beta-1 adrenergic receptor
Type:Protein
Mol. Mass.:50486.84
Organism:Rattus norvegicus (Rat)
Description:P18090
Residue:466
Component 2
Name:Beta-2 adrenergic receptor
Synonyms:ADRB2_RAT Adrb2r | Adrenergic receptor beta
Type:PROTEIN
Mol. Mass.:46896.26
Organism:Rattus norvegicus
Description:ChEMBL_38603
Residue:418
Component 3
Name:Beta-3 adrenergic receptor
Synonyms:ADRB3_RAT Adrb3r Beta-3 adrenergic receptor
Type:PROTEIN
Mol. Mass.:43161.83
Organism:Rattus norvegicus
Description:ChEMBL_1509452
Residue:400
BDBM50223424
NameBDBM50223424
Synonyms:CHEMBL280151
TypeSmall organic molecule
Emp. Form.C11H17NO5S
Mol. Mass.275.321
SMILESCC(C)NCC(c1ccc(O)c(O)c1)S(O)(=O)=O