Reaction Details
TargetProstaglandin G/H synthase 1/2
LigandBDBM50223531
Substrate/Competitorn/a
Meas. Tech.ChEMBL_177015 (CHEMBL779304)
IC50 700±n/a nM
Citation Closse, AHaefliger, WHauser, DGubler, HUDewald, BBaggiolini, M 2,3-Dihydrobenzofuran-2-ones: a new class of highly potent antiinflammatory agents. J Med Chem24:1465-71 (1981) Prostaglandin G/H synthase 1/2
Name:Prostaglandin G/H synthase 1/2
Synonyms:Cyclooxygenase
Type:n/a
Mol. Mass.:n/a
Description:ASSAY_ID of ChEMBL is 1666355
Components:This complex has 2 components.
Component 1
Name:Prostaglandin G/H synthase 2
Type:Enzyme Catalytic Domain
Mol. Mass.:69173.51
Organism:RAT
Description:COX-2 0 RAT::P35355
Residue:604
Component 2
Name:Prostaglandin G/H synthase 1
Synonyms:Cox-1 Cyclooxygenase PGH1_RAT Ptgs1
Type:Enzyme Catalytic Domain
Mol. Mass.:69033.56
Organism:RAT
Description:COX-1 0 RAT::Q63921
Residue:602
BDBM50223531
NameBDBM50223531
Synonyms:CHEMBL35969
TypeSmall organic molecule
Emp. Form.C14H10O2
Mol. Mass.210.228
SMILESO=C1Cc2ccc(cc2O1)-c1ccccc1