Reaction Details
TargetD(1A)/D(2) dopamine receptor
LigandBDBM50224036
Substrate/Competitorn/a
Meas. Tech.ChEMBL_59597 (CHEMBL672154)
IC50 246000±n/a nM
Citation Cannon, JGPerez, JABhatnagar, RKLong, JPSharabi, FM Conformationally restricted congeners of dopamine derived from 2-aminoindan. J Med Chem25:1442-6 (1982) D(1A)/D(2) dopamine receptor
Name:D(1A)/D(2) dopamine receptor
Synonyms:Dopamine receptor
Type:n/a
Mol. Mass.:n/a
Description:ASSAY_ID of ChEMBL is 59578
Components:This complex has 2 components.
Component 1
Name:D(2) dopamine receptor
Type:Enzyme Catalytic Domain
Mol. Mass.:50698.79
Organism:BOVINE
Description:P20288
Residue:444
Component 2
Name:D(1A) dopamine receptor
Synonyms:D(1A) dopamine receptor DOPAMINE D1 DRD1_BOVIN | Dopamine receptor
Type:Enzyme Catalytic Domain
Mol. Mass.:49330.65
Organism:BOVINE
Description:DOPAMINE D1 DRD1 BOVINE::Q95136
Residue:446
BDBM50224036
NameBDBM50224036
Synonyms:CHEMBL543991
TypeSmall organic molecule
Emp. Form.C13H20BrNO2
Mol. Mass.302.207
SMILESBr.CCN(CC)C1Cc2cc(O)c(O)cc2C1