Reaction Details
TargetBeta-1/Beta-2/Beta-3 adrenergic receptor
LigandBDBM25392
Substrate/Competitorn/a
Meas. Tech.ChEMBL_38740 (CHEMBL651098)
IC50 100±n/a nM
Citation Kirk, KLCantacuzčne, DCollins, BChen, GTNimit, YCreveling, CR Syntheses and adrenergic agonist properties of ring-fluorinated isoproterenols. J Med Chem25:680-4 (1982) Beta-1/Beta-2/Beta-3 adrenergic receptor
Name:Beta-1/Beta-2/Beta-3 adrenergic receptor
Synonyms:Adrenergic receptor beta
Type:n/a
Mol. Mass.:n/a
Description:ASSAY_ID of ChEMBL is 1340543
Components:This complex has 3 components.
Component 1
Name:Beta-1 adrenergic receptor
Type:Protein
Mol. Mass.:50486.84
Organism:Rattus norvegicus (Rat)
Description:P18090
Residue:466
Component 2
Name:Beta-2 adrenergic receptor
Synonyms:ADRB2_RAT Adrb2r | Adrenergic receptor beta
Type:PROTEIN
Mol. Mass.:46896.26
Organism:Rattus norvegicus
Description:ChEMBL_38603
Residue:418
Component 3
Name:Beta-3 adrenergic receptor
Synonyms:ADRB3_RAT Adrb3r Beta-3 adrenergic receptor
Type:PROTEIN
Mol. Mass.:43161.83
Organism:Rattus norvegicus
Description:ChEMBL_1509452
Residue:400
BDBM25392
NameBDBM25392
Synonyms:4-[1-hydroxy-2-(isopropylamino)ethyl]pyrocatechol;hydrochloride 4-{1-hydroxy-2-[(propan-2-yl)amino]ethyl}benzene-1,2-diol, 2 ISOPROTERONOL Isoproterenol Isoproterenol,(+) Norisodrine | Novodrin
TypeSmall organic molecule
Emp. Form.C11H17NO3
Mol. Mass.211.2576
SMILESCC(C)NCC(O)c1ccc(O)c(O)c1