Reaction Details
TargetAdenosine receptor A1/A2a/A2b/A3
LigandBDBM50009552
Substrate/Competitorn/a
Meas. Tech.ChEMBL_31136 (CHEMBL876558)
IC50 2.4±n/a nM
Citation Hamilton, HWBristol, JA C4-substituted 1-beta-D-ribofuranosylpyrazolo[3,4-d]pyrimidines as adenosine agonist analogues. J Med Chem26:1601-6 (1983) Adenosine receptor A1/A2a/A2b/A3
Name:Adenosine receptor A1/A2a/A2b/A3
Synonyms:Adenosine receptor
Type:n/a
Mol. Mass.:n/a
Description:ASSAY_ID of ChEMBL is 194205
Components:This complex has 4 components.
Component 1
Name:Adenosine receptor A2a
Type:G Protein-Coupled Receptor (GPCR)
Mol. Mass.:45015.65
Organism:Rattus norvegicus (rat)
Description:Rat A2A receptors expressed in CHO cells.
Residue:410
Component 2
Name:Adenosine receptor A3
Synonyms:AA3R_RAT Adenosine receptor A2a and A3 | Adora3
Type:PROTEIN
Mol. Mass.:36643.73
Organism:Rattus norvegicus
Description:ChEMBL_479910
Residue:320
Component 3
Name:Adenosine receptor A1
Synonyms:AA1R_RAT ADENOSINE A1 high Adenosine A1 receptor (A1) Adenosine receptors A1 | Adora1
Type:Protein
Mol. Mass.:36704.13
Organism:Rattus norvegicus (rat)
Description:n/a
Residue:326
Component 4
Name:Adenosine receptor A2b
Synonyms:AA2BR_RAT Adora2b
Type:PROTEIN
Mol. Mass.:36378.84
Organism:Rattus norvegicus
Description:ChEMBL_32934
Residue:332
BDBM50009552
NameBDBM50009552
Synonyms:2-[6-Amino-2-(2-morpholin-4-yl-ethylamino)-purin-9-yl]-5-hydroxymethyl-tetrahydro-furan-3,4-diol CHEMBL45891 | N6-Cyclohexylado (CHA)
TypeSmall organic molecule
Emp. Form.C16H23N5O4
Mol. Mass.349.3849
SMILESOC[C@H]1O[C@H]([C@H](O)[C@@H]1O)n1cnc2c(NC3CCCCC3)ncnc12