Reaction Details
TargetAmine oxidase [flavin-containing] A/B
LigandBDBM50224952
Substrate/Competitorn/a
Meas. Tech.ChEMBL_122635 (CHEMBL731860)
IC50 4.0±n/a nM
Citation Sahlberg, CRoss, SBFagervall, IAsk, ALClaesson, A Synthesis and monoamine oxidase inhibitory activities of alpha-allenic amines in vivo and in vitro. Different activities of two enantiomeric allenes. J Med Chem26:1036-42 (1983) Amine oxidase [flavin-containing] A/B
Name:Amine oxidase [flavin-containing] A/B
Synonyms:Monoamine oxidase
Type:n/a
Mol. Mass.:n/a
Description:ASSAY_ID of ChEMBL is 122635
Components:This complex has 2 components.
Component 1
Name:Amine oxidase [flavin-containing] B
Type:Enzyme
Mol. Mass.:58469.65
Organism:Rattus norvegicus (rat)
Description:P19643
Residue:520
Component 2
Name:Amine oxidase [flavin-containing] A
Synonyms:AOFA_RAT Amine oxidase [flavin-containing] A Monoamine Oxidase Type A (MAO-A) Monoamine oxidase A (MAO-A) Monoamine oxidase type A (MAOA)
Type:Enzyme
Mol. Mass.:59515.21
Organism:Rattus norvegicus (rat)
Description:n/a
Residue:526
BDBM50224952
NameBDBM50224952
Synonyms:CHEMBL441014
TypeSmall organic molecule
Emp. Form.C14H17Cl2NO
Mol. Mass.286.197
SMILESCN(CCCOc1ccc(Cl)cc1Cl)CC=C=C