Reaction Details
TargetDihydrofolate reductase
LigandBDBM50405061
Substrate/Competitorn/a
Meas. Tech.ChEMBL_54084 (CHEMBL669981)
Ki 141254±n/a nM
Citation Hathaway, BAGuo, ZRHansch, CDelcamp, TJSusten, SSFreisheim, JH Inhibition of human dihydrofolate reductase by 4,6-diamino-1,2-dihydro-2,2-dimethyl-1-(substituted-phenyl)-s-triazine s. A quantitative structure-activity relationship analysis. J Med Chem27:144-9 (1984) Dihydrofolate reductase
Name:Dihydrofolate reductase
Type:Enzyme
Mol. Mass.:21453.99
Organism:Homo sapiens (Human)
Description:Recombinant human DHFR.
Residue:187
BDBM50405061
NameBDBM50405061
Synonyms:CHEMBL6836
TypeSmall organic molecule
Emp. Form.C13H17N5O2
Mol. Mass.275.3064
SMILESCOC(=O)c1ccc(cc1)N1C(N)=NC(N)=NC1(C)C