Reaction Details
TargetBeta-1/Beta-2/Beta-3 adrenergic receptor
LigandBDBM50225367
Substrate/Competitorn/a
Meas. Tech.ChEMBL_38760 (CHEMBL653134)
Kd 1.60±n/a nM
Citation Liptak, AKusiak, JWPitha, J Alkylating beta-blockers: activity of isomeric bromoacetyl alprenolol menthanes. J Med Chem28:1699-703 (1985) Beta-1/Beta-2/Beta-3 adrenergic receptor
Name:Beta-1/Beta-2/Beta-3 adrenergic receptor
Synonyms:Adrenergic receptor beta
Type:n/a
Mol. Mass.:n/a
Description:ASSAY_ID of ChEMBL is 1340543
Components:This complex has 3 components.
Component 1
Name:Beta-1 adrenergic receptor
Type:Protein
Mol. Mass.:50486.84
Organism:Rattus norvegicus (Rat)
Description:P18090
Residue:466
Component 2
Name:Beta-2 adrenergic receptor
Synonyms:ADRB2_RAT Adrb2r | Adrenergic receptor beta
Type:PROTEIN
Mol. Mass.:46896.26
Organism:Rattus norvegicus
Description:ChEMBL_38603
Residue:418
Component 3
Name:Beta-3 adrenergic receptor
Synonyms:ADRB3_RAT Adrb3r Beta-3 adrenergic receptor
Type:PROTEIN
Mol. Mass.:43161.83
Organism:Rattus norvegicus
Description:ChEMBL_1509452
Residue:400
BDBM50225367
NameBDBM50225367
Synonyms:Bromoacetyl Alprenolol Menthane
TypeSmall organic molecule
Emp. Form.C24H37BrN2O3
Mol. Mass.481.466
SMILESCC(C)(NC(=O)CBr)C1CCC(C)(CC1)NCC(O)COc1ccccc1CC=C