Reaction Details
TargetSodium channel protein type 1/2/3 subunit alpha
LigandBDBM50017656
Substrate/Competitorn/a
Meas. Tech.ChEMBL_202547 (CHEMBL806152)
IC50 33000±n/a nM
Citation McNeal, ETLewandowski, GADaly, JWCreveling, CR [3H]Batrachotoxinin A 20 alpha-benzoate binding to voltage-sensitive sodium channels: a rapid and quantitative assay for local anesthetic activity in a variety of drugs. J Med Chem28:381-8 (1985) Sodium channel protein type 1/2/3 subunit alpha
Name:Sodium channel protein type 1/2/3 subunit alpha
Type:n/a
Mol. Mass.:n/a
Description:ASSAY_ID of EBI is 68595
Components:This complex has 3 components.
Component 1
Name:Sodium channel protein type 1 subunit alpha
Synonyms:NAC1 SCN1A Sodium (Site 1) Sodium channel protein type 1 subunit alpha Sodium channel protein type I subunit alpha Voltage-gated sodium channel subunit alpha Nav1.1
Type:Protein
Mol. Mass.:228952.47
Organism:Homo sapiens (Human)
Description:P35498
Residue:2009
Component 2
Name:Sodium channel protein type 2 subunit alpha
Synonyms:HBSC II SCN2A SCN2A2 Sodium (Site 2) Sodium channel protein type 2 alpha subunit Voltage-gated sodium channel subunit alpha Nav1.2
Type:Enzyme
Mol. Mass.:227954.68
Organism:Homo sapiens (Human)
Description:Q99250
Residue:2005
Component 3
Name:Sodium channel protein type 3 subunit alpha
Synonyms:KIAA1356 NAC3 SCN3A_HUMAN Sodium channel alpha subunits; brain (Types I, II, III) Voltage-gated sodium channel subunit alpha Nav1.3 (Nav1.3)
Type:Protein
Mol. Mass.:226276.42
Organism:Homo sapiens (Human)
Description:Q9NY46
Residue:2000
BDBM50017656
NameBDBM50017656
Synonyms:CHEMBL1193 Naphcon-A PHENIRAMINE | Visine-A
TypeSmall organic molecule
Emp. Form.C16H20N2
Mol. Mass.240.3434
SMILESCN(C)CCC(c1ccccc1)c1ccccn1