Reaction Details
TargetProstaglandin G/H synthase 1/2
LigandBDBM85245
Substrate/Competitorn/a
Meas. Tech.ChEMBL_158140 (CHEMBL760772)
IC50 100±n/a nM
Citation Blythin, DJKaminski, JJDomalski, MSSpitler, JSolomon, DMConn, DJWong, SCVerbiar, LLBober, LAChiu, PJ Antiinflammatory activity of substituted 6-hydroxypyrimido[2,1-f]purine-2,4,8(1H,3H,9H)-triones. Atypical nonsteroidal antiinflammatory agents. J Med Chem29:1099-113 (1986) Prostaglandin G/H synthase 1/2
Name:Prostaglandin G/H synthase 1/2
Synonyms:Cyclooxygenase
Type:n/a
Mol. Mass.:n/a
Description:ASSAY_ID of ChEMBL is 1666355
Components:This complex has 2 components.
Component 1
Name:Prostaglandin G/H synthase 2
Type:Enzyme Catalytic Domain
Mol. Mass.:69173.51
Organism:RAT
Description:COX-2 0 RAT::P35355
Residue:604
Component 2
Name:Prostaglandin G/H synthase 1
Synonyms:Cox-1 Cyclooxygenase PGH1_RAT Ptgs1
Type:Enzyme Catalytic Domain
Mol. Mass.:69033.56
Organism:RAT
Description:COX-1 0 RAT::Q63921
Residue:602
BDBM85245
NameBDBM85245
Synonyms:CAS_36322-90-4 Piroxicam
TypeSmall organic molecule
Emp. Form.C15H13N3O4S
Mol. Mass.331.346
SMILESCN1C(C(=O)Nc2ccccn2)=C(O)c2ccccc2S1(=O)=O