Reaction Details
TargetAlpha-1A/Alpha-1B/Alpha-1D adrenergic receptor
LigandBDBM50017679
Substrate/Competitorn/a
Meas. Tech.ChEMBL_32541 (CHEMBL646575)
Ki 1.8±n/a nM
Citation Guérémy, CAudiau, FRenault, CBenavides, JUzan, ALe Fur, G 4-Amino-6-chloro-2-piperazinopyrimidines with selective affinity for alpha 2-adrenoceptors. J Med Chem29:1394-8 (1986) Alpha-1A/Alpha-1B/Alpha-1D adrenergic receptor
Name:Alpha-1A/Alpha-1B/Alpha-1D adrenergic receptor
Type:n/a
Mol. Mass.:n/a
Description:ASSAY_ID of EBI is 303470
Components:This complex has 3 components.
Component 1
Name:Alpha-1B adrenergic receptor
Synonyms:ADA1B_RAT Alpha 1B-adrenoceptor Alpha adrenergic receptor 1A and 1B Alpha-1Adrenoceptor Alpha-1B adrenoreceptor | adrenergic Alpha1B
Type:G Protein-Coupled Receptor (GPCR)
Mol. Mass.:56606.71
Organism:Rattus norvegicus (rat)
Description:Receptor binding assays were performed using rat cortical membranes.
Residue:515
Component 2
Name:Alpha-1A adrenergic receptor
Synonyms:ADA1A_RAT Adra1c Alpha-1A adrenoceptor Alpha-1C adrenergic receptor | adrenergic Alpha1A
Type:Protein
Mol. Mass.:51620.15
Organism:Rattus norvegicus (Rat)
Description:P43140
Residue:466
Component 3
Name:Alpha-1D adrenergic receptor
Synonyms:ADA1D_RAT Adra1d Alpha-1D adrenergic receptor | Serotonin 1a (5-HT1a) receptor/Adrenergic receptor alpha-1
Type:Protein
Mol. Mass.:59375.97
Organism:Rattus norvegicus (Rat)
Description:P23944
Residue:561
BDBM50017679
NameBDBM50017679
Synonyms:Benzyl-(2-chloro-ethyl)-(1-methyl-2-phenoxy-ethyl)-amine Dibenzyline | PHENOXYBENZAMINE
TypeSmall organic molecule
Emp. Form.C18H22ClNO
Mol. Mass.303.826
SMILESCC(COc1ccccc1)N(CCCl)Cc1ccccc1