Reaction Details
TargetDihydrofolate reductase
LigandBDBM50026300
Substrate/Competitorn/a
Meas. Tech.ChEMBL_54735 (CHEMBL667186)
Ki 0.024±n/a nM
Citation Doweyko, AM The hypothetical active site lattice. An approach to modelling active sites from data on inhibitor molecules. J Med Chem31:1396-406 (1988) Dihydrofolate reductase
Name:Dihydrofolate reductase
Type:n/a
Mol. Mass.:17532.46
Organism:Escherichia coli
Description:n/a
Residue:157
BDBM50026300
NameBDBM50026300
Synonyms:6-[5-(2,4-Diamino-pyrimidin-5-ylmethyl)-2,3-dimethoxy-phenoxy]-hexanoic acid | CHEMBL14001
TypeSmall organic molecule
Emp. Form.C19H26N4O5
Mol. Mass.390.4335
SMILESCOc1cc(Cc2cnc(N)nc2N)cc(OCCCCCC(O)=O)c1OC