Reaction Details
TargetDihydrofolate reductase
LigandBDBM50027973
Substrate/Competitorn/a
Meas. Tech.ChEMBL_54735 (CHEMBL667186)
Ki 0.012±n/a nM
Citation Doweyko, AM The hypothetical active site lattice. An approach to modelling active sites from data on inhibitor molecules. J Med Chem31:1396-406 (1988) Dihydrofolate reductase
Name:Dihydrofolate reductase
Type:n/a
Mol. Mass.:17532.46
Organism:Escherichia coli
Description:n/a
Residue:157
BDBM50027973
NameBDBM50027973
Synonyms:6-[2-Bromo-5-(2,4-diamino-pyrimidin-5-ylmethyl)-3-methoxy-phenoxy]-hexanoic acid | CHEMBL286400
TypeSmall organic molecule
Emp. Form.C18H23BrN4O4
Mol. Mass.439.304
SMILESCOc1cc(Cc2cnc(N)nc2N)cc(OCCCCCC(O)=O)c1Br