Reaction Details
TargetDihydrofolate reductase
LigandBDBM50227443
Substrate/Competitorn/a
Meas. Tech.ChEMBL_54735 (CHEMBL667186)
Ki 0.589±n/a nM
Citation Doweyko, AM The hypothetical active site lattice. An approach to modelling active sites from data on inhibitor molecules. J Med Chem31:1396-406 (1988) Dihydrofolate reductase
Name:Dihydrofolate reductase
Type:n/a
Mol. Mass.:17532.46
Organism:Escherichia coli
Description:n/a
Residue:157
BDBM50227443
NameBDBM50227443
Synonyms:CHEMBL418763
TypeSmall organic molecule
Emp. Form.C15H17BrN4O4
Mol. Mass.397.224
SMILESCOc1cc(Cc2cnc(N)nc2N)cc(OCCC(O)=O)c1Br