Reaction Details
TargetDihydrofolate reductase
LigandBDBM50405087
Substrate/Competitorn/a
Meas. Tech.ChEMBL_54735 (CHEMBL667186)
Ki 954±n/a nM
Citation Doweyko, AM The hypothetical active site lattice. An approach to modelling active sites from data on inhibitor molecules. J Med Chem31:1396-406 (1988) Dihydrofolate reductase
Name:Dihydrofolate reductase
Type:n/a
Mol. Mass.:17532.46
Organism:Escherichia coli
Description:n/a
Residue:157
BDBM50405087
NameBDBM50405087
Synonyms:CHEMBL7435
TypeSmall organic molecule
Emp. Form.C15H23N5O
Mol. Mass.289.376
SMILESCCCCOc1cccc(c1)N1C(N)=NC(N)=NC1(C)C