Reaction Details
Target5-hydroxytryptamine receptor 1B
LigandBDBM82087
Substrate/Competitorn/a
Meas. Tech.ChEMBL_1818 (CHEMBL616790)
Ki 6.5±n/a nM
Citation Nichols, DELloyd, DHJohnson, MPHoffman, AJ Synthesis and serotonin receptor affinities of a series of enantiomers of alpha-methyltryptamines: evidence for the binding conformation of tryptamines at serotonin 5-HT1B receptors. J Med Chem31:1406-12 (1988) 5-hydroxytryptamine receptor 1B
Name:5-hydroxytryptamine receptor 1B
Type:Protein
Mol. Mass.:43173.33
Organism:Rattus norvegicus (Rat)
Description:P28564
Residue:386
BDBM82087
NameBDBM82087
Synonyms:2-(5-methoxy-1H-indol-3-yl)ethanamine 5-Methoxytryptamine hydrochloride tryptamine, 5-Methoxy
TypeSmall organic molecule
Emp. Form.C11H14N2O
Mol. Mass.190.2417
SMILESCOc1ccc2[nH]cc(CCN)c2c1