Reaction Details
TargetAlpha-2A adrenergic receptor [16-465]/Alpha-2B adrenergic receptor/Alpha-2C adrenergic receptor
LigandBDBM50227792
Substrate/Competitorn/a
Meas. Tech.ChEMBL_33904 (CHEMBL645513)
IC50 1040±n/a nM
Citation Quaglia, WBrasili, LCristalli, GGiardinà, DPicchio, MTMelchiorre, C Structure-activity relationships among benextramine-related tetraamine disulfides. Chain length effect on alpha-adrenoreceptor blocking activity. J Med Chem31:1861-6 (1988) Alpha-2A adrenergic receptor [16-465]/Alpha-2B adrenergic receptor/Alpha-2C adrenergic receptor
Name:Alpha-2A adrenergic receptor [16-465]/Alpha-2B adrenergic receptor/Alpha-2C adrenergic receptor
Synonyms:Adrenergic receptor alpha-2
Type:n/a
Mol. Mass.:n/a
Description:ASSAY_ID of ChEMBL is 935397
Components:This complex has 3 components.
Component 1
Name:Alpha-2C adrenergic receptor
Type:Enzyme Catalytic Domain
Mol. Mass.:49890.50
Organism:RAT
Description:adrenergic Alpha2 0 RAT::P22086
Residue:458
Component 2
Name:Alpha-2B adrenergic receptor
Synonyms:ADA2B_RAT Adrenergic receptor alpha Alpha-2B adrenergic receptor Alpha-2B adrenoreceptor | adrenergic Alpha2B
Type:Enzyme Catalytic Domain
Mol. Mass.:50379.83
Organism:NEONATAL RAT
Description:adrenergic Alpha2B ADRA2B NEONATAL RAT::P19328
Residue:453
Component 3
Name:Alpha-2A adrenergic receptor [16-465]
Synonyms:ADA2A_RAT Adrenaline 2 Alpha-2A adrenoceptor Alpha-2AAR Alpha2 Adrenoreceptor adrenergic Alpha2A
Type:G-protein coupled receptor
Mol. Mass.:48961.69
Organism:Rattus norvegicus (rat)
Description:P22909[16-465]
Residue:450
BDBM50227792
NameBDBM50227792
Synonyms:CHEMBL55957
TypeSmall organic molecule
Emp. Form.C34H58N4O2S2
Mol. Mass.618.98
SMILESCOc1ccccc1CNCCCCCCCNCCSSCCNCCCCCCCNCc1ccccc1OC