Reaction Details
TargetCholecystokinin receptor type A/Gastrin/cholecystokinin type B receptor
LigandBDBM50228287
Substrate/Competitorn/a
Meas. Tech.ChEMBL_40036 (CHEMBL653017)
IC50 4.2±n/a nM
Citation Parsons, WHPatchett, AAHolloway, MKSmith, GMDavidson, JLLotti, VJChang, RS Cholecystokinin antagonists. Synthesis and biological evaluation of 3-substituted benzolactams. J Med Chem32:1681-5 (1989) Cholecystokinin receptor type A/Gastrin/cholecystokinin type B receptor
Name:Cholecystokinin receptor type A/Gastrin/cholecystokinin type B receptor
Synonyms:Cholecystokinin receptor
Type:n/a
Mol. Mass.:n/a
Description:ASSAY_ID of ChEMBL is 1544143
Components:This complex has 2 components.
Component 1
Name:Gastrin/cholecystokinin type B receptor
Type:Enzyme Catalytic Domain
Mol. Mass.:48980.43
Organism:RAT
Description:Cholecystokinin A CCKBR RAT::P30553
Residue:452
Component 2
Name:Cholecystokinin receptor type A
Synonyms:CCKAR_RAT Cholecystokinin peripheral Cholecystokinin receptor type A
Type:Enzyme Catalytic Domain
Mol. Mass.:49676.37
Organism:RAT
Description:Cholecystokinin central 0 RAT::P30551
Residue:444
BDBM50228287
NameBDBM50228287
Synonyms:CHEMBL1907960
TypeSmall organic molecule
Emp. Form.C27H28N2O4
Mol. Mass.444.5222
SMILES[H][C@]1(CCc2ccccc2N(CC(=O)OC(C)(C)C)C1=O)NC(=O)c1ccc2ccccc2c1