Reaction Details
TargetCholecystokinin receptor type A/Gastrin/cholecystokinin type B receptor
LigandBDBM50018287
Substrate/Competitorn/a
Meas. Tech.ChEMBL_49565 (CHEMBL663481)
IC50 7.5±n/a nM
Citation Parsons, WHPatchett, AAHolloway, MKSmith, GMDavidson, JLLotti, VJChang, RS Cholecystokinin antagonists. Synthesis and biological evaluation of 3-substituted benzolactams. J Med Chem32:1681-5 (1989) Cholecystokinin receptor type A/Gastrin/cholecystokinin type B receptor
Name:Cholecystokinin receptor type A/Gastrin/cholecystokinin type B receptor
Synonyms:Cholecystokinin receptor
Type:n/a
Mol. Mass.:n/a
Description:ASSAY_ID of ChEMBL is 1544143
Components:This complex has 2 components.
Component 1
Name:Gastrin/cholecystokinin type B receptor
Type:Enzyme Catalytic Domain
Mol. Mass.:48980.43
Organism:RAT
Description:Cholecystokinin A CCKBR RAT::P30553
Residue:452
Component 2
Name:Cholecystokinin receptor type A
Synonyms:CCKAR_RAT Cholecystokinin peripheral Cholecystokinin receptor type A
Type:Enzyme Catalytic Domain
Mol. Mass.:49676.37
Organism:RAT
Description:Cholecystokinin central 0 RAT::P30551
Residue:444
BDBM50018287
NameBDBM50018287
Synonyms:(R)-{3-[(Naphthalene-2-carbonyl)-amino]-2-oxo-2,3,4,5-tetrahydro-benzo[b]azepin-1-yl}-acetic acid tert-butyl ester {3-[(Naphthalene-2-carbonyl)-amino]-2-oxo-2,3,4,5-tetrahydro-benzo[b]azepin-1-yl}-acetic acid tert-butyl ester
TypeSmall organic molecule
Emp. Form.C27H28N2O4
Mol. Mass.444.5222
SMILESCC(C)(C)OC(=O)CN1c2ccccc2CCC(NC(=O)c2ccc3ccccc3c2)C1=O