Reaction Details
TargetCholecystokinin receptor type A/Gastrin/cholecystokinin type B receptor
LigandBDBM50005463
Substrate/Competitorn/a
Meas. Tech.ChEMBL_49565 (CHEMBL663481)
IC50 0.800000±n/a nM
Citation Parsons, WHPatchett, AAHolloway, MKSmith, GMDavidson, JLLotti, VJChang, RS Cholecystokinin antagonists. Synthesis and biological evaluation of 3-substituted benzolactams. J Med Chem32:1681-5 (1989) Cholecystokinin receptor type A/Gastrin/cholecystokinin type B receptor
Name:Cholecystokinin receptor type A/Gastrin/cholecystokinin type B receptor
Synonyms:Cholecystokinin receptor
Type:n/a
Mol. Mass.:n/a
Description:ASSAY_ID of ChEMBL is 1544143
Components:This complex has 2 components.
Component 1
Name:Gastrin/cholecystokinin type B receptor
Type:Enzyme Catalytic Domain
Mol. Mass.:48980.43
Organism:RAT
Description:Cholecystokinin A CCKBR RAT::P30553
Residue:452
Component 2
Name:Cholecystokinin receptor type A
Synonyms:CCKAR_RAT Cholecystokinin peripheral Cholecystokinin receptor type A
Type:Enzyme Catalytic Domain
Mol. Mass.:49676.37
Organism:RAT
Description:Cholecystokinin central 0 RAT::P30551
Residue:444
BDBM50005463
NameBDBM50005463
Synonyms:(R)-1H-Indole-2-carboxylic acid (1-methyl-2-oxo-5-phenyl-2,3-dihydro-1H-benzo[e][1,4]diazepin-3-yl)-amide: 0.1C4H10O (S)-N-(1-methyl-2-oxo-5-phenyl-2,3-dihydro-1H-benzo[e][1,4]diazepin-3-yl)-1H-indole-2-carboxamide 1H-Indole-2-carboxylic acid ((S)-1-methyl-2-oxo-5-phenyl-2,3-dihydro-1H-benzo[e][1,4]diazepin-3-yl)-amide 1H-Indole-2-carboxylic acid (1-methyl-2-oxo-5-phenyl-2,3-dihydro-1H-benzo[e][1,4]diazepin-3-yl)-amide (L-364,718 ((S)-devazepide) 1H-Indole-2-carboxylic acid (1-methyl-2-oxo-5-phenyl-2,3-dihydro-1H-benzo[e][1,4]diazepin-3-yl)-amide(Devazepide or (R) L364718) 1H-Indole-2-carboxylic acid (1-methyl-2-oxo-5-phenyl-2,3-dihydro-1H-benzo[e][1,4]diazepin-3-yl)-amide(devazepide) CCK antagonist synthetic 17 CHEMBL9506 L-364,718 MK-329
TypeSmall organic molecule
Emp. Form.C25H20N4O2
Mol. Mass.408.4519
SMILESCN1c2ccccc2C(=N[C@H](NC(=O)c2cc3ccccc3[nH]2)C1=O)c1ccccc1