Reaction Details
TargetcAMP-dependent protein kinase catalytic subunit gamma
LigandBDBM50228846
Substrate/Competitorn/a
Meas. Tech.ChEMBL_161403 (CHEMBL768312)
IC50 1200±n/a nM
Citation Ricouart, AGesquiere, JCTartar, ASergheraert, C Design of potent protein kinase inhibitors using the bisubstrate approach. J Med Chem34:73-8 (1991) cAMP-dependent protein kinase catalytic subunit gamma
Name:cAMP-dependent protein kinase catalytic subunit gamma
Type:PROTEIN
Mol. Mass.:40442.03
Organism:Homo sapiens (Human)
Description:ChEMBL_104720
Residue:351
BDBM50228846
NameBDBM50228846
Synonyms:CHEMBL265876
TypeSmall organic molecule
Emp. Form.C42H70N20O11S
Mol. Mass.1063.198
SMILES[#6]-[#6@H](-[#7]-[#6](=O)-[#6@H](-[#6])-[#7]S(=O)(=O)c1cccc2cnccc12)-[#6](=O)-[#7]-[#6@@H](-[#6]-[#8])-[#6](=O)-[#7]-[#6@@H](-[#6]-[#6]-[#6]\[#7]=[#6](\[#7])-[#7])-[#6](=O)-[#7]-[#6@@H](-[#6]-[#6]-[#6]\[#7]=[#6](\[#7])-[#7])-[#6](=O)-[#7]-[#6@@H](-[#6]-[#6]-[#6]\[#7]=[#6](\[#7])-[#7])-[#6](=O)-[#7]-[#6@@H](-[#6]-[#6]-[#6]\[#7]=[#6](\[#7])-[#7])-[#6](-[#8])=O