Reaction Details
TargetEstrogen receptor beta
LigandBDBM50230557
Substrate/Competitorn/a
Meas. Tech.ChEMBL_65915 (CHEMBL677161)
IC50 120±n/a nM
Citation Jones, CDBlaszczak, LCGoettel, MESuarez, TCrowell, TAMabry, TERuenitz, PCSrivatsan, V Antiestrogens. 3. Estrogen receptor affinities and antiproliferative effects in MCF-7 cells of phenolic analogues of trioxifene, [3,4-dihydro-2-(4- methoxyphenyl)-1-naphthalenyl][4-[2-(1-pyrrolidinyl)ethoxy]- phenyl]methanone. J Med Chem35:931-8 (1992) Estrogen receptor beta
Name:Estrogen receptor beta
Synonyms:Estrogen receptor
Type:n/a
Mol. Mass.:n/a
Description:ASSAY_ID of ChEMBL is 99778
Components:This complex has 2 components.
Component 1
Name:Estrogen receptor beta
Type:Protein
Mol. Mass.:59238.43
Organism:Homo sapiens (Human)
Description:Q92731
Residue:530
Component 2
Name:Estrogen receptor
Synonyms:ER ESR ESR1_HUMAN Estrogen receptor Estrogen receptor (ER-alpha) Estrogen receptor alpha (ER) Nuclear receptor subfamily 3 group A member 1
Type:Protein
Mol. Mass.:66230.44
Organism:Homo sapiens (Human)
Description:P03372
Residue:595
BDBM50230557
NameBDBM50230557
Synonyms:CHEBI:90187 | LY-117018
TypeSmall organic molecule
Emp. Form.C27H25NO4S
Mol. Mass.459.557
SMILESOc1ccc(cc1)-c1sc2cc(O)ccc2c1C(=O)c1ccc(OCCN2CCCC2)cc1