Reaction Details
TargetEstrogen receptor beta
LigandBDBM50230558
Substrate/Competitorn/a
Meas. Tech.ChEMBL_65915 (CHEMBL677161)
IC50 740±n/a nM
Citation Jones, CDBlaszczak, LCGoettel, MESuarez, TCrowell, TAMabry, TERuenitz, PCSrivatsan, V Antiestrogens. 3. Estrogen receptor affinities and antiproliferative effects in MCF-7 cells of phenolic analogues of trioxifene, [3,4-dihydro-2-(4- methoxyphenyl)-1-naphthalenyl][4-[2-(1-pyrrolidinyl)ethoxy]- phenyl]methanone. J Med Chem35:931-8 (1992) Estrogen receptor beta
Name:Estrogen receptor beta
Synonyms:Estrogen receptor
Type:n/a
Mol. Mass.:n/a
Description:ASSAY_ID of ChEMBL is 99778
Components:This complex has 2 components.
Component 1
Name:Estrogen receptor beta
Type:Protein
Mol. Mass.:59238.43
Organism:Homo sapiens (Human)
Description:Q92731
Residue:530
Component 2
Name:Estrogen receptor
Synonyms:ER ESR ESR1_HUMAN Estrogen receptor Estrogen receptor (ER-alpha) Estrogen receptor alpha (ER) Nuclear receptor subfamily 3 group A member 1
Type:Protein
Mol. Mass.:66230.44
Organism:Homo sapiens (Human)
Description:P03372
Residue:595
BDBM50230558
NameBDBM50230558
Synonyms:CHEMBL2112949
TypeSmall organic molecule
Emp. Form.C30H29NO2
Mol. Mass.435.5568
SMILESOc1ccc2c3C(c4ccccc4-c3ccc2c1)c1ccc(OCCN2CCCCC2)cc1