Reaction Details
TargetGastrin/cholecystokinin type B receptor
LigandBDBM50230680
Substrate/Competitorn/a
Meas. Tech.ChEMBL_48424 (CHEMBL660352)
Ki 2.0±n/a nM
Citation Higginbottom, MKneen, CRatcliffe, GS Rationally designed"dipeptoid" analogues of CCK. A Free-Wilson/Fujita-Ban analysis of some alpha-methyltryptophan derivatives as CCK-B antagonists. J Med Chem35:1572-7 (1992) Gastrin/cholecystokinin type B receptor
Name:Gastrin/cholecystokinin type B receptor
Type:Enzyme Catalytic Domain
Mol. Mass.:49196.59
Organism:MOUSE
Description:Cholecystokinin A CCKBR MOUSE::P56481
Residue:453
BDBM50230680
NameBDBM50230680
Synonyms:CHEMBL3350364
TypeSmall organic molecule
Emp. Form.C35H44N4O6
Mol. Mass.616.7471
SMILES[H][C@]12CC[C@@](C)([C@H](C1)OC(=O)N[C@](C)(Cc1c[nH]c3ccccc13)C(=O)NC[C@H](NC(=O)CCC(O)=O)c1ccccc1)C2(C)C