Reaction Details
TargetAlpha-2A adrenergic receptor [16-465]/Alpha-2B adrenergic receptor/Alpha-2C adrenergic receptor
LigandBDBM50230851
Substrate/Competitorn/a
Meas. Tech.ChEMBL_34207 (CHEMBL649224)
Ki 473±n/a nM
Citation Chern, JWTao, PLYen, MHLu, GYShiau, CYLai, YJChien, SLChan, CH Studies on quinazolines. 5. 2,3-dihydroimidazo[1,2-c]quinazoline derivatives: a novel class of potent and selective alpha 1-adrenoceptor antagonists and antihypertensive agents. J Med Chem36:2196-207 (1993) 
 
Alpha-2A adrenergic receptor [16-465]/Alpha-2B adrenergic receptor/Alpha-2C adrenergic receptor
Name:Alpha-2A adrenergic receptor [16-465]/Alpha-2B adrenergic receptor/Alpha-2C adrenergic receptor
Synonyms:Adrenergic receptor alpha-2
Type:n/a
Mol. Mass.:n/a
Description:ASSAY_ID of ChEMBL is 935397
Components:This complex has 3 components.
Component 1
Name:Alpha-2C adrenergic receptor
Type:Enzyme Catalytic Domain
Mol. Mass.:49890.50
Organism:RAT
Description:adrenergic Alpha2 0 RAT::P22086
Residue:458
Component 2
Name:Alpha-2B adrenergic receptor
Synonyms:ADA2B_RAT Adrenergic receptor alpha Alpha-2B adrenergic receptor Alpha-2B adrenoreceptor | adrenergic Alpha2B
Type:Enzyme Catalytic Domain
Mol. Mass.:50379.83
Organism:NEONATAL RAT
Description:adrenergic Alpha2B ADRA2B NEONATAL RAT::P19328
Residue:453
Component 3
Name:Alpha-2A adrenergic receptor [16-465]
Synonyms:ADA2A_RAT Adrenaline 2 Alpha-2A adrenoceptor Alpha-2AAR Alpha2 Adrenoreceptor adrenergic Alpha2A
Type:G-protein coupled receptor
Mol. Mass.:48961.69
Organism:Rattus norvegicus (rat)
Description:P22909[16-465]
Residue:450
BDBM50230851
NameBDBM50230851
Synonyms:CHEMBL70347
TypeSmall organic molecule
Emp. Form.C22H24ClN5O
Mol. Mass.409.912
SMILESCN1C(=O)N2CC(CN3CCN(CC3)c3ccccc3Cl)N=C2c2ccccc12