Reaction Details
TargetDNA topoisomerase 2-alpha/2-beta
LigandBDBM50231257
Substrate/Competitorn/a
Meas. Tech.ChEMBL_208607 (CHEMBL812284)
EC50 1200±n/a nM
Citation Wentland, MPLesher, GYReuman, MGruett, MDSingh, BAldous, SCDorff, PHRake, JBCoughlin, SA Mammalian topoisomerase II inhibitory activity of 1-cyclopropyl-6,8- difluoro-1,4-dihydro-7-(2,6-dimethyl-4-pyridinyl)-4-oxo-3-quinolinecarb oxylic acid and related derivatives. J Med Chem36:2801-9 (1993) 
 
DNA topoisomerase 2-alpha/2-beta
Name:DNA topoisomerase 2-alpha/2-beta
Synonyms:DNA topoisomerase II
Type:n/a
Mol. Mass.:n/a
Description:ASSAY_ID of ChEMBL is 1821483
Components:This complex has 2 components.
Component 1
Name:DNA topoisomerase 2-alpha
Type:Protein
Mol. Mass.:174415.30
Organism:Homo sapiens (Human)
Description:P11388
Residue:1531
Component 2
Name:DNA topoisomerase 2-beta
Synonyms:DNA topoisomerase II TOP2B | TOP2B_HUMAN
Type:PROTEIN
Mol. Mass.:183284.13
Organism:Homo sapiens (Human)
Description:ChEMBL_51583
Residue:1626
BDBM50231257
NameBDBM50231257
Synonyms:CHEMBL96510
TypeSmall organic molecule
Emp. Form.C19H13F2NO4
Mol. Mass.357.3076
SMILESOC(=O)c1cn(C2CC2)c2c(F)c(c(F)cc2c1=O)-c1ccc(O)cc1