Reaction Details
TargetMelatonin receptor type 1A/1B/1C
LigandBDBM50043289
Substrate/Competitorn/a
Meas. Tech.ChEMBL_104761 (CHEMBL710993)
Ki 0.340000±n/a nM
Citation Copinga, STepper, PGGrol, CJHorn, ASDubocovich, ML 2-Amido-8-methoxytetralins: a series of nonindolic melatonin-like agents. J Med Chem36:2891-8 (1993) 
 
Melatonin receptor type 1A/1B/1C
Name:Melatonin receptor type 1A/1B/1C
Synonyms:Melatonin receptor
Type:n/a
Mol. Mass.:n/a
Description:ASSAY_ID of ChEMBL is 104753
Components:This complex has 3 components.
Component 1
Name:Melatonin receptor type 1A
Type:PROTEIN
Mol. Mass.:39911.03
Organism:Gallus gallus
Description:ChEMBL_104739
Residue:353
Component 2
Name:Melatonin receptor type 1B
Synonyms:MEL-1B-R Melatonin Melatonin receptor type 1B
Type:Enzyme Catalytic Domain
Mol. Mass.:33012.73
Organism:Chick
Description:Melatonin 0 Chick::P51050
Residue:289
Component 3
Name:Melatonin receptor type 1C
Synonyms:CKB Mel-1C-R Melatonin receptor type 1C
Type:PROTEIN
Mol. Mass.:38595.98
Organism:Gallus gallus
Description:ChEMBL_104739
Residue:346
BDBM50043289
NameBDBM50043289
Synonyms:CHEMBL34730 N-[2-(6-Chloro-5-methoxy-1H-indol-3-yl)-ethyl]-acetamide(6-Chloromelatonin) | melatonin, 6-Chloro
TypeSmall organic molecule
Emp. Form.C13H15ClN2O2
Mol. Mass.266.723
SMILESCOc1cc2c(CCNC(C)=O)c[nH]c2cc1Cl