Reaction Details
TargetLeukotriene B4 receptor 1/2
LigandBDBM50036743
Substrate/Competitorn/a
Meas. Tech.ChEMBL_74972 (CHEMBL684131)
Ki 14±n/a nM
Citation Sofia, MJFloreancig, PBach, NJBaker, SRCockerham, SLFleisch, JHFroelich, LLJackson, WTMarder, PRoman, CR o-phenylphenols: potent and orally active leukotriene B4 receptor antagonists. J Med Chem36:3978-81 (1993) 
 
Leukotriene B4 receptor 1/2
Name:Leukotriene B4 receptor 1/2
Synonyms:Leukotriene B4 receptor
Type:n/a
Mol. Mass.:n/a
Description:ASSAY_ID of ChEMBL is 88360
Components:This complex has 2 components.
Component 1
Name:Leukotriene B4 receptor 2
Type:Enzyme Catalytic Domain
Mol. Mass.:37964.86
Organism:Homo sapiens (Human)
Description:Leukotriene 2 0 HUMAN::Q9NPC1
Residue:358
Component 2
Name:Leukotriene B4 receptor 1
Synonyms:BLT BLTR Chemoattractant receptor-like 1 GPR16 LTB4-R 1 Leukotriene B4 R1 Leukotriene B4 receptor 1 P2Y purinoceptor 7 | P2Y7
Type:Enzyme Catalytic Domain
Mol. Mass.:37582.68
Organism:Homo sapiens (Human)
Description:Q15722
Residue:352
BDBM50036743
NameBDBM50036743
Synonyms:CHEMBL60617 sodium 4-ethyl-5-[6-methyl-6-(2H-1,2,3,4-tetraazol-5-yl)heptyloxy]-2-propylphenol
TypeSmall organic molecule
Emp. Form.C20H31N4O2
Mol. Mass.359.4863
SMILESCCCc1cc(CC)c(OCCCCCC(C)(C)c2nn[n-]n2)cc1O