Reaction Details
TargetLeukotriene B4 receptor 1/2
LigandBDBM50231626
Substrate/Competitorn/a
Meas. Tech.ChEMBL_88179 (CHEMBL700859)
IC50 3.0±n/a nM
Citation Sofia, MJFloreancig, PBach, NJBaker, SRCockerham, SLFleisch, JHFroelich, LLJackson, WTMarder, PRoman, CR o-phenylphenols: potent and orally active leukotriene B4 receptor antagonists. J Med Chem36:3978-81 (1993) 
 
Leukotriene B4 receptor 1/2
Name:Leukotriene B4 receptor 1/2
Synonyms:Leukotriene B4 receptor
Type:n/a
Mol. Mass.:n/a
Description:ASSAY_ID of ChEMBL is 88360
Components:This complex has 2 components.
Component 1
Name:Leukotriene B4 receptor 2
Type:Enzyme Catalytic Domain
Mol. Mass.:37964.86
Organism:Homo sapiens (Human)
Description:Leukotriene 2 0 HUMAN::Q9NPC1
Residue:358
Component 2
Name:Leukotriene B4 receptor 1
Synonyms:BLT BLTR Chemoattractant receptor-like 1 GPR16 LTB4-R 1 Leukotriene B4 R1 Leukotriene B4 receptor 1 P2Y purinoceptor 7 | P2Y7
Type:Enzyme Catalytic Domain
Mol. Mass.:37582.68
Organism:Homo sapiens (Human)
Description:Q15722
Residue:352
BDBM50231626
NameBDBM50231626
Synonyms:CHEMBL128013
TypeSmall organic molecule
Emp. Form.C23H29N4NaO2
Mol. Mass.416.4917
SMILES[Na+].CCc1cc(c(O)cc1OCCCCCC(C)(C)c1nn[n-]n1)-c1ccccc1