Reaction Details
TargetCoagulation factor XII
LigandBDBM50229738
Substrate/Competitorn/a
Meas. Tech.ChEBML_1644378
Ki 1.6±n/a nM
Citation Middendorp, SJWilbs, JQuarroz, CCalzavarini, SAngelillo-Scherrer, AHeinis, C Peptide Macrocycle Inhibitor of Coagulation Factor XII with Subnanomolar Affinity and High Target Selectivity. J Med Chem60:1151-1158 (2017) 
 
Coagulation factor XII
Name:Coagulation factor XII
Type:Enzyme
Mol. Mass.:67810.07
Organism:Homo sapiens (Human)
Description:P00748
Residue:615
BDBM50229738
NameBDBM50229738
Synonyms:CHEMBL4087027
TypeSmall organic molecule
Emp. Form.C81H135FN32O18S3
Mol. Mass.1960.336
SMILESCC(C)C[C@@H]1NC(=O)[C@H](CCC(N)=O)NC(=O)[C@H](CCCNC(N)=N)NC(=O)[C@@H]2CSCCC(=O)N3CN(CN(C3)C(=O)CCSC[C@H](NC(=O)[C@@H](N)CCNC(N)=N)C(=O)N[C@@H](Cc3ccc(F)cc3)C(=O)N[C@@H](CCCNC(N)=N)C(=O)N[C@@H](CC(C)C)C(=O)N3CCC[C@H]3C(=O)N2)C(=O)CCSC[C@H](NC(=O)[C@H](CCCNC(N)=N)NC1=O)C(=O)N[C@@H](CCCNC(N)=N)C(O)=O