Reaction Details
TargetCoagulation factor XII
LigandBDBM50230023
Substrate/Competitorn/a
Meas. Tech.ChEMBL_1644378 (CHEMBL3993307)
Ki 14±n/a nM
Citation Middendorp, SJWilbs, JQuarroz, CCalzavarini, SAngelillo-Scherrer, AHeinis, C Peptide Macrocycle Inhibitor of Coagulation Factor XII with Subnanomolar Affinity and High Target Selectivity. J Med Chem60:1151-1158 (2017) 
 
Coagulation factor XII
Name:Coagulation factor XII
Type:Enzyme
Mol. Mass.:67810.07
Organism:Homo sapiens (Human)
Description:P00748
Residue:615
BDBM50230023
NameBDBM50230023
Synonyms:CHEMBL4094726
TypeSmall organic molecule
Emp. Form.C81H136N32O18S3
Mol. Mass.1942.345
SMILESCC(C)C[C@@H]1NC(=O)[C@H](CCC(N)=O)NC(=O)[C@H](CCCNC(N)=N)NC(=O)[C@@H]2CSCCC(=O)N3CN(CN(C3)C(=O)CCSC[C@H](NC(=O)[C@H](N)CCNC(N)=N)C(=O)N[C@@H](Cc3ccccc3)C(=O)N[C@@H](CCCNC(N)=N)C(=O)N[C@@H](CC(C)C)C(=O)N3CCC[C@H]3C(=O)N2)C(=O)CCSC[C@H](NC(=O)[C@H](CCCNC(N)=N)NC1=O)C(=O)N[C@@H](CCCNC(N)=N)C(O)=O