Reaction Details
TargetCannabinoid receptor 1
LigandBDBM50230411
Substrate/Competitorn/a
Meas. Tech.ChEMBL_1644839 (CHEMBL3993768)
Ki 8.1±n/a nM
Citation Iyer, MRCinar, RKatz, AGao, MErdelyi, KJourdan, TCoffey, NJPacher, PKunos, G Design, Synthesis, and Biological Evaluation of Novel, Non-Brain-Penetrant, Hybrid Cannabinoid CB J Med Chem60:1126-1141 (2017) 
 
Cannabinoid receptor 1
Name:Cannabinoid receptor 1
Type:Enzyme
Mol. Mass.:52842.52
Organism:Mus musculus (Mouse)
Description:P47746
Residue:473
BDBM50230411
NameBDBM50230411
Synonyms:RAC-IBIPINABANT | SLV-319
TypeSmall organic molecule
Emp. Form.C23H20Cl2N4O2S
Mol. Mass.487.402
SMILESCN\C(=N/S(=O)(=O)c1ccc(Cl)cc1)N1CC(C(=N1)c1ccc(Cl)cc1)c1ccccc1