Reaction Details
TargetCannabinoid receptor 2
LigandBDBM50230412
Substrate/Competitorn/a
Meas. Tech.ChEMBL_1644841 (CHEMBL3993770)
Ki>1000±n/a nM
Citation Iyer, MRCinar, RKatz, AGao, MErdelyi, KJourdan, TCoffey, NJPacher, PKunos, G Design, Synthesis, and Biological Evaluation of Novel, Non-Brain-Penetrant, Hybrid Cannabinoid CB J Med Chem60:1126-1141 (2017) 
 
Cannabinoid receptor 2
Name:Cannabinoid receptor 2
Type:Enzyme Catalytic Domain
Mol. Mass.:38220.43
Organism:MOUSE
Description:P47936
Residue:347
BDBM50230412
NameBDBM50230412
Synonyms:CHEMBL4070796
TypeSmall organic molecule
Emp. Form.C26H25Cl2N5O2S2
Mol. Mass.574.545
SMILESCC(C)S\C(N)=N/C(=N\S(=O)(=O)c1ccc(Cl)cc1)/N1CC(C(=N1)c1ccc(Cl)cc1)c1ccccc1