Reaction Details
TargetCannabinoid receptor 1
LigandBDBM50230412
Substrate/Competitorn/a
Meas. Tech.ChEMBL_1644839 (CHEMBL3993768)
Ki 166±n/a nM
Citation Iyer, MRCinar, RKatz, AGao, MErdelyi, KJourdan, TCoffey, NJPacher, PKunos, G Design, Synthesis, and Biological Evaluation of Novel, Non-Brain-Penetrant, Hybrid Cannabinoid CB J Med Chem60:1126-1141 (2017) 
 
Cannabinoid receptor 1
Name:Cannabinoid receptor 1
Type:Enzyme
Mol. Mass.:52842.52
Organism:Mus musculus (Mouse)
Description:P47746
Residue:473
BDBM50230412
NameBDBM50230412
Synonyms:CHEMBL4070796
TypeSmall organic molecule
Emp. Form.C26H25Cl2N5O2S2
Mol. Mass.574.545
SMILESCC(C)S\C(N)=N/C(=N\S(=O)(=O)c1ccc(Cl)cc1)/N1CC(C(=N1)c1ccc(Cl)cc1)c1ccccc1