Reaction Details
TargetCannabinoid receptor 1
LigandBDBM50230387
Substrate/Competitorn/a
Meas. Tech.ChEMBL_1644840 (CHEMBL3993769)
IC50 441±n/a nM
Citation Iyer, MRCinar, RKatz, AGao, MErdelyi, KJourdan, TCoffey, NJPacher, PKunos, G Design, Synthesis, and Biological Evaluation of Novel, Non-Brain-Penetrant, Hybrid Cannabinoid CB J Med Chem60:1126-1141 (2017) 
 
Cannabinoid receptor 1
Name:Cannabinoid receptor 1
Type:Enzyme
Mol. Mass.:52842.52
Organism:Mus musculus (Mouse)
Description:P47746
Residue:473
BDBM50230387
NameBDBM50230387
Synonyms:CHEMBL4062181
TypeSmall organic molecule
Emp. Form.C31H27Cl2N5O2S2
Mol. Mass.636.614
SMILESN\C(SCCc1ccccc1)=N\C(=N/S(=O)(=O)c1ccc(Cl)cc1)\N1CC(C(=N1)c1ccc(Cl)cc1)c1ccccc1