Reaction Details
TargetSialic acid-binding Ig-like lectin 7
LigandBDBM50230579
Substrate/Competitorn/a
Meas. Tech.ChEMBL_1644940 (CHEMBL3993869)
IC50 8075000±n/a nM
Citation Prescher, HFrank, MGütgemann, SKuhfeldt, ESchweizer, ANitschke, LWatzl, CBrossmer, R Design, Synthesis, and Biological Evaluation of Small, High-Affinity Siglec-7 Ligands: Toward Novel Inhibitors of Cancer Immune Evasion. J Med Chem60:941-956 (2017) 
 
Sialic acid-binding Ig-like lectin 7
Name:Sialic acid-binding Ig-like lectin 7
Type:PROTEIN
Mol. Mass.:51147.68
Organism:Homo sapiens (Human)
Description:ChEMBL_109858
Residue:467
BDBM50230579
NameBDBM50230579
Synonyms:CHEMBL4077460
TypeSmall organic molecule
Emp. Form.C12H20NNaO9
Mol. Mass.345.2783
SMILES[Na+].[H][C@]1(OC(C[C@H](O)[C@H]1NC(C)=O)(OC)C([O-])=O)[C@H](O)[C@H](O)CO