Reaction Details
TargetMelatonin receptor type 1A
LigandBDBM50230955
Substrate/Competitorn/a
Meas. Tech.ChEMBL_1645057 (CHEMBL3993986)
Ki 0.300000±n/a nM
Citation Landagaray, EEttaoussi, MRami, MBoutin, JACaignard, DHDelagrange, PMelnyk, PBerthelot, PYous, S New quinolinic derivatives as melatonergic ligands: Synthesis and pharmacological evaluation. Eur J Med Chem127:621-631 (2017) 
 
Melatonin receptor type 1A
Name:Melatonin receptor type 1A
Type:Enzyme
Mol. Mass.:39392.94
Organism:Homo sapiens (Human)
Description:P48039
Residue:350
BDBM50230955
NameBDBM50230955
Synonyms:CHEMBL4102177
TypeSmall organic molecule
Emp. Form.C14H16N2O2
Mol. Mass.244.289
SMILESCOc1ccc2cccc(CCNC(C)=O)c2n1