Reaction Details
TargetMelatonin receptor type 1B
LigandBDBM50230958
Substrate/Competitorn/a
Meas. Tech.ChEMBL_1645058 (CHEMBL3993987)
Ki 0.200000±n/a nM
Citation Landagaray, EEttaoussi, MRami, MBoutin, JACaignard, DHDelagrange, PMelnyk, PBerthelot, PYous, S New quinolinic derivatives as melatonergic ligands: Synthesis and pharmacological evaluation. Eur J Med Chem127:621-631 (2017) 
 
Melatonin receptor type 1B
Name:Melatonin receptor type 1B
Type:Enzyme
Mol. Mass.:40203.54
Organism:Homo sapiens (Human)
Description:P49286
Residue:362
BDBM50230958
NameBDBM50230958
Synonyms:CHEMBL4071572
TypeSmall organic molecule
Emp. Form.C13H15N3O2
Mol. Mass.245.2771
SMILESCOc1ccc2cccc(CCNC(N)=O)c2n1